JumpStartKit install hangs at 87% complete during database creation / instance configuration - WebCenter Portal JSK

Hello folks, I'm wanting to evaluate Oracle WebCenter Portal 11.1.1.8 (huge improvement over 11.1.1.7, which I have already gave a quick try in the VDI provided by Oracle).    So I found out about this Jump Start Kit, which installs each required piece once you've got a properly configured Linux environment. I had some fun with the prereqs but now that's all completed and I got SO EXCITED to make it past "STEP 4".    So now I'm encountering the same issue during installation -- in STEP 6 of 22 Configuration of Database Instance (Completing Database Creation) it gets to 87% complete and then nothing seems to happen, it never gets beyond that point even if I wait 10 more hours:  ***NOTE: I suspect my issue is not specific to the "Jump Start Kit", but rather it is something others have encountered during the Database creation/configuration step of the Oracle Universal Installer in general. And hopefully others have solved it.*** "/opt/oracle/portal" is my INSTALL_DIR ; I had launched the JSK installer with this command:./runme INSTANCE_PASSWORD=apwd ROOT_PASSWORD=rpwd DOWNLOAD_DIR=/media/sf_Downloads/JSKfiles INSTALL_DIR=/opt/oracle/portal  - The installer makes it this far, before it seems to get "stuck" -- even after many hours there is no change, HD is not doing anything, CPU stays at <5% usage:rtkit.main.JSKStarter - launchScript:172 - Tue Jun 10 15:41:38 MDT 2014: BEGIN STEP 6 of 22: Configuration of Database Instance. Estimated time is around 5 minutes. Please wait..10/06/2014 15:41:38.545 -(3)- JSK Starter Thread - oracle.webcenter.jumpstartkit.main.JSKStarter - launchScript:172 -10/06/2014 15:41:48.222 -(3)- JSK Starter Thread - oracle.webcenter.jumpstartkit.main.JSKStarter - launchScript:172 - Copying database files10/06/2014 15:41:48.413 -(3)- JSK Starter Thread - oracle.webcenter.jumpstartkit.main.JSKStarter - launchScript:172 - 1% complete10/06/2014 15:41:52.894 -(3)- JSK Starter Thread - oracle.webcenter.jumpstartkit.main.JSKStarter - launchScript:172 - 3% complete10/06/2014 15:41:52.915 -(3)- JSK Starter Thread - oracle.webcenter.jumpstartkit.main.JSKStarter - launchScript:172 - 11% complete10/06/2014 15:42:02.917 -(3)- JSK Starter Thread - oracle.webcenter.jumpstartkit.main.JSKStarter - launchScript:172 - 18% complete10/06/2014 15:42:32.920 -(3)- JSK Starter Thread - oracle.webcenter.jumpstartkit.main.JSKStarter - launchScript:172 - 26% complete10/06/2014 15:42:42.638 -(3)- JSK Starter Thread - oracle.webcenter.jumpstartkit.main.JSKStarter - launchScript:172 - 37% complete10/06/2014 15:42:42.640 -(3)- JSK Starter Thread - oracle.webcenter.jumpstartkit.main.JSKStarter - launchScript:172 - Creating and starting Oracle instance10/06/2014 15:42:48.568 -(3)- JSK Starter Thread - oracle.webcenter.jumpstartkit.main.JSKStarter - launchScript:172 - 40% complete10/06/2014 15:42:56.827 -(3)- JSK Starter Thread - oracle.webcenter.jumpstartkit.main.JSKStarter - launchScript:172 - 45% complete10/06/2014 15:42:57.357 -(3)- JSK Starter Thread - oracle.webcenter.jumpstartkit.main.JSKStarter - launchScript:172 - 46% complete10/06/2014 15:42:57.526 -(3)- JSK Starter Thread - oracle.webcenter.jumpstartkit.main.JSKStarter - launchScript:172 - 47% complete10/06/2014 15:42:57.627 -(3)- JSK Starter Thread - oracle.webcenter.jumpstartkit.main.JSKStarter - launchScript:172 - 48% complete10/06/2014 15:42:57.834 -(3)- JSK Starter Thread - oracle.webcenter.jumpstartkit.main.JSKStarter - launchScript:172 - 49% complete10/06/2014 15:44:42.915 -(3)- JSK Starter Thread - oracle.webcenter.jumpstartkit.main.JSKStarter - launchScript:172 - 54% complete10/06/2014 15:44:42.963 -(3)- JSK Starter Thread - oracle.webcenter.jumpstartkit.main.JSKStarter - launchScript:172 - 59% complete10/06/2014 15:44:43.036 -(3)- JSK Starter Thread - oracle.webcenter.jumpstartkit.main.JSKStarter - launchScript:172 - 60% complete10/06/2014 15:44:43.452 -(3)- JSK Starter Thread - oracle.webcenter.jumpstartkit.main.JSKStarter - launchScript:172 - 61% complete10/06/2014 15:44:43.452 -(3)- JSK Starter Thread - oracle.webcenter.jumpstartkit.main.JSKStarter - launchScript:172 - 64% complete10/06/2014 15:44:43.453 -(3)- JSK Starter Thread - oracle.webcenter.jumpstartkit.main.JSKStarter - launchScript:172 - Completing Database Creation10/06/2014 15:44:43.493 -(3)- JSK Starter Thread - oracle.webcenter.jumpstartkit.main.JSKStarter - launchScript:172 - 68% complete10/06/2014 15:44:43.510 -(3)- JSK Starter Thread - oracle.webcenter.jumpstartkit.main.JSKStarter - launchScript:172 - 72% complete10/06/2014 15:44:43.571 -(3)- JSK Starter Thread - oracle.webcenter.jumpstartkit.main.JSKStarter - launchScript:172 - 76% complete10/06/2014 15:45:01.516 -(3)- JSK Starter Thread - oracle.webcenter.jumpstartkit.main.JSKStarter - launchScript:172 - 87% complete    I am using VirtualBox on Windows 7, I have tried it multiple times, first with the guest OS as Oracle Linux 6, and then Oracle Linux 5 (fun learning about updating the version of Java!).  It always gets to the same point and then it just seems to do nothing -- no progress, but no error message on-screen (see log files below). But it seems to be using less than 5% CPU usage... and waiting 10 hours makes no difference.  Based on what I found in tons of Google searching, I tried increasing my swap file, adding more memory and HD space (12GB RAM and 10GB sap and 20GB free hard drive space) but still nothing changed.      In post #2 of this thread I will separately provide the logging details, which I hope will be helpful.  Thanks in advance!Darren.  PS: moderator, I attempted to create this thread in other Spaces because I did not know about this "Portal JSK" specific one -- was that why my thread was rejected? NO REASON WAS GIVEN. If that WAS the reason, I have to say that it will be nearly impossible for anyone who is able to help me to actually FIND this thread here because as I said I do not think it specific to ONLY the Portal JSK. (But I will post it only here just in case that's the reason for the previous rejections)

Pl post the last 100 lines from the database alert log

First off, thank you very much for not just deleting the other 2 threads -- I intentionally created them in the other 2 spaces that MIGHT find a set of eyes that can help -- but in both I linked to THIS thread because this is the specific product. So this is the only place replies will be found therefore no "duplication" to worry about... but as I said this is likely not specific to PortalJSK since others on the internet have described a similar problem during the Oracle database installation.    Second of all. here we go, the log contents...  ...So in the hope that I could troubleshoot based on some error logging, I had a look inside "/opt/oracle/portal/db/OraInventory/logs/"...        - "/opt/oracle/portal/db/OraInventory/logs/oraInstall2014-06-10_03-27-37PM.err" is empty (0 bytes),    - "/opt/oracle/portal/db/OraInventory/logs/installActions2014-06-10_03-27-37PM.log" * (2.3MB) ends with...INFO: Terminating all background operationsINFO: Terminated all background operationsINFO: Successfully executed the flow in SILENT modeINFO: Finding the most appropriate exit status for the current applicationINFO: Exit Status is 0INFO: Shutdown Oracle Database 11g Release 2 InstallerINFO: Unloading Setup Driver[eof]        I am not sure of the value of the additional log files inside "/opt/oracle/run/logs/", here is what they contain...    - all of the "/opt/oracle/run/logs/xyz_NofN.zip.unzip.out" files are empty (0 bytes).    - "/opt/oracle/run/logs/install_commands.log" is tiny, it just has this:/media/sf_Downloads/JSKfiles/DB/database/runInstaller -invPtrLoc /opt/oracle/run/linux64/dborainst.loc  -ignoreSysPrereqs  -ignorePrereq -force -silent -waitforcompletion -responseFile /opt/oracle/run/linux64/db_generated.rsp/opt/oracle/portal/db/ohome/bin/netca /orahome /opt/oracle/portal/db/ohome /orahnam orcl /instype typical /inscomp client,oraclenet,javavm,server,ano /insprtcl tcp /cfg local /authadp NO_VALUE /responseFile /opt/oracle/run/linux64/netca.rsp /silent/opt/oracle/portal/db/ohome/bin/dbca -silent -responseFile /opt/oracle/run/linux64/dbca.rsp  -sampleSchema true -oratabLocation ORATAB        - "webtier_prereqs.log" and "ecm_prereqs.log" and "wcprereqs.log" all say that all tests passed.(Tests for HD and RAM space and swap size and # of processes etc. are all SUCCESS; and all required packages are installed and high enough version, etc.)        - "/opt/oracle/run/logs/dbprereqs_log.txt" says this:Starting Oracle Universal Installer...Checking Temp space: must be greater than 120 MB.   Actual 8855 MB    PassedChecking swap space: must be greater than 150 MB.   Actual 4031 MB    PassedPreparing to launch Oracle Universal Installer from /opt/oracle/portal/tmpdir/OraInstall2014-06-10_03-26-23PM. Please wait ...[WARNING] [INS-13014] Target environment do not meet some optional requirements.   CAUSE: Some of the optional prerequisites are not met. See logs for details. /opt/oracle/portal/db/OraInventory/logs/installActions2014-06-10_03-26-23PM.log   ACTION: Identify the list of failed prerequisite checks from the log: /opt/oracle/portal/db/OraInventory/logs/installActions2014-06-10_03-26-23PM.log. Then either from the log file or from installation manual find the appropriate configuration to meet the prerequisites and fix it manually.        - "/opt/oracle/run/logs/wls-install.log" is the most confusing, maybe this is the reason for getting "stuck"?2014-06-10 15:24:38,139 WARN  [home] com.bea.cie.gpr.internal.model.JvmTargetManagerImpl - Property value for linux32_jdk160_29b11.zip not found..2014-06-10 15:24:38,143 WARN  [home] com.bea.cie.gpr.internal.model.JvmTargetManagerImpl - Property value for linux_ia32_jrockit_160_29_D1.2.0-10_jdk.zip not found..2014-06-10 15:24:38,206 WARN  [home] com.bea.cie.gpr.internal.model.JvmTargetManagerImpl - Property value for linux32_jdk160_29b11.zip not found..2014-06-10 15:24:38,209 WARN  [home] com.bea.cie.gpr.internal.model.JvmTargetManagerImpl - Property value for linux_ia32_jrockit_160_29_D1.2.0-10_jdk.zip not found..2014-06-10 15:24:38,225 WARN  [home] com.bea.plateng.wizard.installer.silent.tasks.SilentBEAHomeTask - /opt/oracle/portal/fmw directory is not empty. Proceed with installation?2014-06-10 15:24:39,223 WARN  [ocmCredVerify] com.bea.plateng.wizard.installer.helpers.OCMInstallHelper - Failed test connectionjava.lang.reflect.InvocationTargetException  at sun.reflect.NativeMethodAccessorImpl.invoke0(Native Method)  at sun.reflect.NativeMethodAccessorImpl.invoke(NativeMethodAccessorImpl.java:39)  at sun.reflect.DelegatingMethodAccessorImpl.invoke(DelegatingMethodAccessorImpl.java:25)  at java.lang.reflect.Method.invoke(Method.java:597)  at com.bea.plateng.wizard.installer.helpers.OCMInstallHelper.testConnection(OCMInstallHelper.java:92)  at com.bea.plateng.wizard.installer.silent.tasks.OCMCredVerifySilentTask.execute(OCMCredVerifySilentTask.java:35)  at com.bea.plateng.wizard.silent.tasks.AbstractSilentTask.run(AbstractSilentTask.java:28)  at java.lang.Thread.run(Thread.java:662)Caused by: com.bea.plateng.wizard.installer.helpers.OCMException: Connection failed in SSL peer verificaition.  at com.bea.plateng.wizard.installer.helpers.OCMHelper.testSimpleConnection(OCMHelper.java:54)  at com.bea.plateng.wizard.installer.helpers.OCMHelper.testConnection(OCMHelper.java:145)  ... 8 more2014-06-10 15:24:39,228 WARN  [ocmCredVerify] com.bea.plateng.wizard.installer.silent.tasks.OCMCredVerifySilentTask - OCMInstallException:com.bea.plateng.wizard.installer.helpers.OCMInstallException  at com.bea.plateng.wizard.installer.helpers.OCMInstallHelper.testConnection(OCMInstallHelper.java:96)  at com.bea.plateng.wizard.installer.silent.tasks.OCMCredVerifySilentTask.execute(OCMCredVerifySilentTask.java:35)  at com.bea.plateng.wizard.silent.tasks.AbstractSilentTask.run(AbstractSilentTask.java:28)  at java.lang.Thread.run(Thread.java:662)...2014-06-10 15:25:49,347 INFO  [Thread-13] com.oracle.cie.domain.TemplateImporter - Domain Extension Successful!2014-06-10 15:25:49,350 INFO  [runScript] com.oracle.cie.domain.script.ScriptExecutor - close template2014-06-10 15:25:49,351 INFO  [runScript] com.oracle.cie.domain.script.ScriptExecutor - succeed: close template2014-06-10 15:25:49,351 INFO  [runScript] com.oracle.cie.domain.script.ScriptExecutor - read domain from "/opt/oracle/portal/fmw/wlserver_10.3/samples/domains/medrec-spring"2014-06-10 15:25:49,405 INFO  [runScript] com.oracle.cie.domain.script.ScriptExecutor - succeed: read domain from "/opt/oracle/portal/fmw/wlserver_10.3/samples/domains/medrec-spring"2014-06-10 15:25:49,405 INFO  [runScript] com.oracle.cie.domain.script.ScriptExecutor - succeed: update domain2014-06-10 15:25:49,406 INFO  [runScript] com.oracle.cie.domain.script.ScriptExecutor - close template2014-06-10 15:25:49,406 INFO  [runScript] com.oracle.cie.domain.script.ScriptExecutor - succeed: close template2014-06-10 15:25:49,743 INFO  [WizardController] com.bea.plateng.wizard.silent.tasks.LogTask - The installation was successfull!^ ^ ^ BUT IT SEEMS TO END AS A "SUCCESS"!?        - "install_setup.log" ends with the following -- and so does "JSKDownloader.log" (the "master log"? it contains basically what shows up on-screen)rtkit.main.JSKStarter - launchScript:172 - Tue Jun 10 15:41:38 MDT 2014: BEGIN STEP 6 of 22: Configuration of Database Instance. Estimated time is around 5 minutes. Please wait..10/06/2014 15:41:38.545 -(3)- JSK Starter Thread - oracle.webcenter.jumpstartkit.main.JSKStarter - launchScript:172 -10/06/2014 15:41:48.222 -(3)- JSK Starter Thread - oracle.webcenter.jumpstartkit.main.JSKStarter - launchScript:172 - Copying database files10/06/2014 15:41:48.413 -(3)- JSK Starter Thread - oracle.webcenter.jumpstartkit.main.JSKStarter - launchScript:172 - 1% complete10/06/2014 15:41:52.894 -(3)- JSK Starter Thread - oracle.webcenter.jumpstartkit.main.JSKStarter - launchScript:172 - 3% complete10/06/2014 15:41:52.915 -(3)- JSK Starter Thread - oracle.webcenter.jumpstartkit.main.JSKStarter - launchScript:172 - 11% complete10/06/2014 15:42:02.917 -(3)- JSK Starter Thread - oracle.webcenter.jumpstartkit.main.JSKStarter - launchScript:172 - 18% complete10/06/2014 15:42:32.920 -(3)- JSK Starter Thread - oracle.webcenter.jumpstartkit.main.JSKStarter - launchScript:172 - 26% complete10/06/2014 15:42:42.638 -(3)- JSK Starter Thread - oracle.webcenter.jumpstartkit.main.JSKStarter - launchScript:172 - 37% complete10/06/2014 15:42:42.640 -(3)- JSK Starter Thread - oracle.webcenter.jumpstartkit.main.JSKStarter - launchScript:172 - Creating and starting Oracle instance10/06/2014 15:42:48.568 -(3)- JSK Starter Thread - oracle.webcenter.jumpstartkit.main.JSKStarter - launchScript:172 - 40% complete10/06/2014 15:42:56.827 -(3)- JSK Starter Thread - oracle.webcenter.jumpstartkit.main.JSKStarter - launchScript:172 - 45% complete10/06/2014 15:42:57.357 -(3)- JSK Starter Thread - oracle.webcenter.jumpstartkit.main.JSKStarter - launchScript:172 - 46% complete10/06/2014 15:42:57.526 -(3)- JSK Starter Thread - oracle.webcenter.jumpstartkit.main.JSKStarter - launchScript:172 - 47% complete10/06/2014 15:42:57.627 -(3)- JSK Starter Thread - oracle.webcenter.jumpstartkit.main.JSKStarter - launchScript:172 - 48% complete10/06/2014 15:42:57.834 -(3)- JSK Starter Thread - oracle.webcenter.jumpstartkit.main.JSKStarter - launchScript:172 - 49% complete10/06/2014 15:44:42.915 -(3)- JSK Starter Thread - oracle.webcenter.jumpstartkit.main.JSKStarter - launchScript:172 - 54% complete10/06/2014 15:44:42.963 -(3)- JSK Starter Thread - oracle.webcenter.jumpstartkit.main.JSKStarter - launchScript:172 - 59% complete10/06/2014 15:44:43.036 -(3)- JSK Starter Thread - oracle.webcenter.jumpstartkit.main.JSKStarter - launchScript:172 - 60% complete10/06/2014 15:44:43.452 -(3)- JSK Starter Thread - oracle.webcenter.jumpstartkit.main.JSKStarter - launchScript:172 - 61% complete10/06/2014 15:44:43.452 -(3)- JSK Starter Thread - oracle.webcenter.jumpstartkit.main.JSKStarter - launchScript:172 - 64% complete10/06/2014 15:44:43.453 -(3)- JSK Starter Thread - oracle.webcenter.jumpstartkit.main.JSKStarter - launchScript:172 - Completing Database Creation10/06/2014 15:44:43.493 -(3)- JSK Starter Thread - oracle.webcenter.jumpstartkit.main.JSKStarter - launchScript:172 - 68% complete10/06/2014 15:44:43.510 -(3)- JSK Starter Thread - oracle.webcenter.jumpstartkit.main.JSKStarter - launchScript:172 - 72% complete10/06/2014 15:44:43.571 -(3)- JSK Starter Thread - oracle.webcenter.jumpstartkit.main.JSKStarter - launchScript:172 - 76% complete10/06/2014 15:45:01.516 -(3)- JSK Starter Thread - oracle.webcenter.jumpstartkit.main.JSKStarter - launchScript:172 - 87% complete            * Here are the final 261 lines of "/opt/oracle/portal/db/OraInventory/logs/installActions2014-06-10_03-27-37PM.log"...--------------------------------------------------------------------------------INFO: Start output from spawned process:INFO: ----------------------------------INFO:    INFO: SaveInvWCCE JRE files in ScratchINFO: oracle.installer.mandatorySetup property is set to false, so skipping the execution of additional toolsINFO: oracle.installer.installUpdates property is set to false, so skipping the checking of updatesINFO: Config Initialize JRE files in ScratchINFO: stage loc: /opt/oracle/portal/tmpdir/OraInstall2014-06-10_03-27-37PM/INFO: Copying Aggr XML for: Oracle Configuration ManagerINFO: stage loc: /opt/oracle/portal/tmpdir/OraInstall2014-06-10_03-27-37PM/INFO: Copying Aggr XML for: HAS Common FilesINFO: stage loc: /opt/oracle/portal/tmpdir/OraInstall2014-06-10_03-27-37PM/INFO: Copying Aggr XML for: Oracle Netca ClientINFO: stage loc: /opt/oracle/portal/tmpdir/OraInstall2014-06-10_03-27-37PM/INFO: Copying Aggr XML for: Database Configuration and Upgrade AssistantsINFO: stage loc: /opt/oracle/portal/tmpdir/OraInstall2014-06-10_03-27-37PM/INFO: Copying Aggr XML for: Oracle Enterprise Manager Console DBINFO: stage loc: /opt/oracle/portal/tmpdir/OraInstall2014-06-10_03-27-37PM/INFO: Copying Aggr XML for: Oracle Database 11gINFO: The Top level Aggreage File = /opt/oracle/portal/db/ohome/inventory/ContentsXML/ConfigXML/oracle.server.11_2_0_1_0.xmlINFO: OUI_CAPlugIn is not found in XMLINFO: no. of tools to supress: 0 for comp: Oracle Enterprise Manager Console DBINFO: cf session will be created for OH: /opt/oracle/portal/db/ohome/ TLAggr: oracle.server instancePath: inventory/ContentsXML/ConfigXML/INFO: cf session for OH: /opt/oracle/portal/db/ohome/ TL Aggr: [oracle.server] instancePath: inventory/ContentsXML/ConfigXML/INFO: aggr ref length : 6INFO: cf session hashcode: 620301082INFO: cf session saved with key: OraDb11g_home1 oracle.serverINFO: cf session is okINFO: created and saved cf session for oh: OraDb11g_home1INFO: passing params to cfINFO: Handling the storing of variables for aggr name  oracle.sysman.ccrINFO: This variable s_OPSNodeInfoString is not added to the global context mapINFO: This variable b_isUNIX is not added to the global context mapINFO: This variable b_createResponseFile is not added to the global context mapINFO: This variable s_ps is not added to the global context mapINFO: This variable s_oraName is not added to the global context mapINFO: This variable s_ccrJarDestination is not added to the global context mapINFO: This variable b_localInstall is not added to the global context mapINFO: This variable b_doConfigCCR is not added to the global context mapINFO: This variable b_ccrUpgrade is not added to the global context mapINFO: This variable s_rspFilePath is not added to the global context mapINFO: This variable PROD_HOME is not added to the global context mapINFO: for oracle.has.common no aggregate found by cf: no configurationINFO: Handling the storing of variables for aggr name  oracle.assistants.netca.clientINFO: This variable s_swingallName is not added to the global context mapINFO: This variable s_shareName is not added to the global context mapINFO: This variable s_runtimeLib is not added to the global context mapINFO: This variable s_runTimeJar is not added to the global context mapINFO: This variable s_responseFileName is not added to the global context mapINFO: This variable s_operatingSystem is not added to the global context mapINFO: This variable s_netcfgName is not added to the global context mapINFO: This variable s_netcahelpName is not added to the global context mapINFO: This variable s_netcaUpgradeFlag is not added to the global context mapINFO: This variable s_netcaClass is not added to the global context mapINFO: This variable s_netCA_Args is not added to the global context mapINFO: This variable s_netCAInstalledProtocols is not added to the global context mapINFO: This variable s_netAPIName is not added to the global context mapINFO: This variable s_ldapclnt9 is not added to the global context mapINFO: This variable s_ldapclnt11 is not added to the global context mapINFO: This variable s_ldapclnt10 is not added to the global context mapINFO: This variable s_jreLocation is not added to the global context mapINFO: This variable s_jreJarFile is not added to the global context mapINFO: This variable s_jreJar is not added to the global context mapINFO: This variable s_jewtName is not added to the global context mapINFO: This variable s_installTypeForLaunchNETCA is not added to the global context mapINFO: This variable s_icebrowserName is not added to the global context mapINFO: This variable s_helpName is not added to the global context mapINFO: This variable s_ewtcompatName is not added to the global context mapINFO: This variable s_ewtName is not added to the global context mapINFO: This variable s_ewtFile is not added to the global context mapINFO: This variable s_ewtCompat is not added to the global context mapINFO: This variable s_cfgMethod is not added to the global context mapINFO: This variable s_caHelpZhTwJar is not added to the global context mapINFO: This variable s_caHelpZhCnJar is not added to the global context mapINFO: This variable s_caHelpPtBRJar is not added to the global context mapINFO: This variable s_caHelpKoJar is not added to the global context mapINFO: This variable s_caHelpJar is not added to the global context mapINFO: This variable s_caHelpJaJar is not added to the global context mapINFO: This variable s_caHelpItJar is not added to the global context mapINFO: This variable s_caHelpFrJar is not added to the global context mapINFO: This variable s_caHelpEsJar is not added to the global context mapINFO: This variable s_caHelpDeJar is not added to the global context mapINFO: This variable s_authAdaptors is not added to the global context mapINFO: This variable ps_netCA_Args_OverRide is not added to the global context mapINFO: This variable b_net8ServerInstalling is not added to the global context mapINFO: This variable b_javavmIsInstalling is not added to the global context mapINFO: This variable b_isWindows is not added to the global context mapINFO: This variable b_isUNIX is not added to the global context mapINFO: This variable b_cmanIsInstalling is not added to the global context mapINFO: This variable b_anoIsInstalling is not added to the global context mapINFO: This variable s_xmlparservLoc is not added to the global context mapINFO: This variable s_ouiJlibDir is not added to the global context mapINFO: This variable s_opsmJlib is not added to the global context mapINFO: This variable s_ntwkTools is not added to the global context mapINFO: This variable s_netjlibDir is not added to the global context mapINFO: This variable s_netcahelpLocation is not added to the global context mapINFO: This variable s_netcaJlibDir is not added to the global context mapINFO: This variable s_netcaDocDir is not added to the global context mapINFO: This variable s_netPropertiesFile is not added to the global context mapINFO: This variable s_netCA is not added to the global context mapINFO: This variable s_net8caFileToInstantiate is not added to the global context mapINFO: This variable s_jre15Location is not added to the global context mapINFO: This variable s_jlibDir is not added to the global context mapINFO: This variable s_inventoryPrereqOui is not added to the global context mapINFO: This variable s_emdwLibDir is not added to the global context mapINFO: This variable s_caHelpDir is not added to the global context mapINFO: This variable s_assistantJlibDir is not added to the global context mapINFO: This variable s_JavaFlag is not added to the global context mapINFO: This variable b_isOPS is not added to the global context mapINFO: This variable s_windowsCommandLine is not added to the global context mapINFO: This variable s_net8caExecutable is not added to the global context mapINFO: This variable s_netcaUserDirArg is not added to the global context mapINFO: This variable s_installTypeForNetCA is not added to the global context mapINFO: This variable s_netcaSilentFlag is not added to the global context mapINFO: This variable s_netCAInstalledProducts is not added to the global context mapINFO: This variable s_netcaClasspath is not added to the global context mapINFO: This variable PROD_HOME is not added to the global context mapINFO: ORACLE_HOME is not settable, hence not setting the valueINFO: Handling the storing of variables for aggr name  oracle.assistants.serverINFO: This variable s_operatingSystem is not added to the global context mapINFO: This variable s_jreLocation is not added to the global context mapINFO: This variable pn_dboffset is not added to the global context mapINFO: This variable cs_swingName is not added to the global context mapINFO: This variable cs_komodoName is not added to the global context mapINFO: This variable cs_kodiakName is not added to the global context mapINFO: This variable cs_jewtName is not added to the global context mapINFO: This variable cs_iceBrowserName is not added to the global context mapINFO: This variable cs_ewtcompatName is not added to the global context mapINFO: This variable cs_ewtName is not added to the global context mapINFO: This variable cs_baliShareName is not added to the global context mapINFO: This variable b_orabaseContainsOrahome is not added to the global context mapINFO: This variable b_isWINDOWS is not added to the global context mapINFO: This variable b_isUNIX is not added to the global context mapINFO: This variable sl_dbmaParameterListForIcon is not added to the global context mapINFO: This variable sl_dbcaParameterListForIcon is not added to the global context mapINFO: This variable s_xmlparservLoc is not added to the global context mapINFO: This variable s_ouiJlibLocation is not added to the global context mapINFO: This variable s_oratabLocation is not added to the global context mapINFO: This variable s_opsmLocation is not added to the global context mapINFO: This variable s_dbuaLocation is not added to the global context mapINFO: This variable s_dbcaLocation is not added to the global context mapINFO: This variable s_OracleBinLocation is not added to the global context mapINFO: This variable s_dbcaInstLaunchFile is not added to the global context mapINFO: This variable s_dbcaLaunchFile is not added to the global context mapINFO: This variable s_dbmaLaunchFile is not added to the global context mapINFO: This variable s_dbmaInstLaunchFile is not added to the global context mapINFO: This variable PROD_HOME is not added to the global context mapINFO: ORACLE_HOME is not settable, hence not setting the valueINFO: Handling the storing of variables for aggr name  oracle.sysman.console.dbINFO: This variable s_sid is not added to the global context mapINFO: This variable s_serverInstallType is not added to the global context mapINFO: This variable s_platform is not added to the global context mapINFO: HashMap added with the key oracle.sysman.console.db and an empty variable VectorINFO: Adding the variable s_obfOc4jAdmPasswd to the aggregate oracle.sysman.console.dbINFO: Adding the variable s_obfOc4jAdmPasswd to the global context map for the aggregate oracle.sysman.console.dbINFO: Adding the variable s_obfJtaAdmPasswd to the aggregate oracle.sysman.console.dbINFO: Adding the variable s_obfJtaAdmPasswd to the global context map for the aggregate oracle.sysman.console.dbINFO: This variable s_nlsLang is not added to the global context mapINFO: This variable s_emailServer is not added to the global context mapINFO: This variable s_emailAddress is not added to the global context mapINFO: This variable s_cfgtyperet is not added to the global context mapINFO: Adding the variable s_JtaAdmPasswd to the aggregate oracle.sysman.console.dbINFO: Adding the variable s_JtaAdmPasswd to the global context map for the aggregate oracle.sysman.console.dbINFO: This variable n_uploadInterval is not added to the global context mapINFO: This variable localhost is not added to the global context mapINFO: This variable b_launchTools is not added to the global context mapINFO: This variable b_launchBrowser is not added to the global context mapINFO: This variable b_isUNIX is not added to the global context mapINFO: This variable b_centralConsole is not added to the global context mapINFO: This variable USE_HTTP_PROXY is not added to the global context mapINFO: This variable USE_DB_CONSOLE is not added to the global context mapINFO: This variable SET_CONSOLE_MODE is not added to the global context mapINFO: This variable SA_SETUP is not added to the global context mapINFO: This variable OC4JLOC is not added to the global context mapINFO: This variable NO_PC_MODE is not added to the global context mapINFO: This variable LOGGING_LEVEL is not added to the global context mapINFO: This variable JRE_HOME is not added to the global context mapINFO: This variable ISQLPLUS_PROTOCOL is not added to the global context mapINFO: This variable ISQLPLUS_PORT is not added to the global context mapINFO: This variable HOST_SID_OFFSET_ENABLED is not added to the global context mapINFO: This variable HOSTNAME is not added to the global context mapINFO: This variable EM_UPLOAD_DISABLE is not added to the global context mapINFO: This variable EM_UIX_DEBUG_FLAG is not added to the global context mapINFO: This variable EMPRODVER is not added to the global context mapINFO: This variable CONSOLE_MODE is not added to the global context mapINFO: This variable CONSOLE_CFG is not added to the global context mapINFO: This variable sl_oraclehomes is not added to the global context mapINFO: This variable s_oc4jDir is not added to the global context mapINFO: This variable s_oc4jAppsDir is not added to the global context mapINFO: This variable s_jreHome is not added to the global context mapINFO: This variable s_configcommand is not added to the global context mapINFO: This variable b_isRAC is not added to the global context mapINFO: This variable b_UNIX is not added to the global context mapINFO: This variable OJSP_JAR_LOC is not added to the global context mapINFO: This variable OJSPUTIL_JAR_LOC is not added to the global context mapINFO: This variable LDAP_JAR_LOC is not added to the global context mapINFO: This variable JAVA_HOME is not added to the global context mapINFO: This variable ISQLPLUS_HOST is not added to the global context mapINFO: This variable EM_UIX_LOCATION is not added to the global context mapINFO: This variable EM_REPOS_HOST is not added to the global context mapINFO: This variable EM_PING_COMMAND is not added to the global context mapINFO: This variable EM_OC4J_HOME is not added to the global context mapINFO: This variable EM_EAR_LOC is not added to the global context mapINFO: This variable EMDROOT is not added to the global context mapINFO: Adding the variable s_oc4jAdmPasswd to the aggregate oracle.sysman.console.dbINFO: Adding the variable s_oc4jAdmPasswd to the global context map for the aggregate oracle.sysman.console.dbINFO: This variable s_launchBrowserClasspath is not added to the global context mapINFO: This variable s_javapOracleHome is not added to the global c

Related

Creating Maven deployment for oracle 12C SOA projects

I am using my local system only and enot sure why i am getting this error.,  do you ave any idea ? mvn install:install-file -Dfile=oracle-maven-sync-12.1.3.jar -DpomFile=oracle-maven-sync-12.1.3.pom  - this worked BUILD SUCCESSmvn com.oracle.maven:oracle-maven-sync:push -DoracleHome=C:\Oracle\Middleware\Oracle_Home- this worked BUILD SUCCESSmvn archetype:crawl -Dcatalog=C:\Users\samy\.m2\archetype-catalog.xml- this worked BUILD SUCCESSWhen i try to create application and project ,, mvn archetype:generate -DarchetypeGroupId=com.oracle.soa.archetype -DarchetypeArtifactId=oracle-soa-application -DarchetypeVersion=12.1.3-0-0 -DgroupId=org.my.test -DartifactId=test-soa-application -DprojectName=test-soa-project -Dversion=1.0-SNAPSHOT- this one is failing with following ERROR [DEBUG] Writing resolution tracking file C:\Users\samy\.m2\repository\com\oracle\soa\archetype\oracle-soa-application\12.1.3-0-0\oracle-soa-application-12.1.3-0-0.jar.lastUpdated [DEBUG] Archetype com.oracle.soa.archetype:oracle-soa-application:12.1.3-0-0 doesn't existorg.apache.maven.archetype.downloader.DownloadException: Error downloading com.oracle.soa.archetype:oracle-soa-application:jar:12.1.3-0-0.fYI : this folder contains the only one .lastUpdated only C:\Users\samy\.m2\repository\com\oracle\soa\archetype\oracle-soa-application\12.1.3-0-0oracle-soa-application-12.1.3-0-0.jar.lastUpdated
Does the file C:\Users\samy\.m2\repository\com\oracle\soa\archetype\oracle-soa-application\12.1.3-0-0\oracle-soa-application-12.1.3-0-0.jar exist?  It should have been pushed to your local repo by the oracle-maven-sync push goal, provided that the Oracle Home you pointed it at contained a valid SOA 12.1.3 installation.  Given the message above, I suspect it doesn't exist.  Please verify that $ORACLE_HOME/soa/plugins/maven/com/oracle/soa/archetype/oracle-soa-application/12.1.3/oracle-soa-application-12.1.3.jar (and .pom) exist in the Oracle Home and re-run the push against that Oracle Home. I just ran the push on a SOA 12.1.3 installation and ran the command you showed and it worked properly: D:\tmp>mvn archetype:generate -DarchetypeGroupId=com.oracle.soa.archetype -DarchetypeArtifactId=oracle-soa-application -DarchetypeVersion=12.1.3-0-0 -DgroupId=org.my.test -DartifactId=test-soa-application -DprojectName=test-soa-project -Dversion=1.0-SNAPSHOT[INFO] Scanning for projects.........[INFO] Using property: groupId = org.my.test[INFO] Using property: artifactId = test-soa-application[INFO] Using property: version = 1.0-SNAPSHOT[INFO] Using property: package = org.my.test[INFO] Using property: adf = .adf[INFO] Using property: data = .data[INFO] Using property: projectName = test-soa-projectConfirm properties configuration:groupId: org.my.testartifactId: test-soa-applicationversion: 1.0-SNAPSHOTpackage: org.my.testadf: .adfdata: .dataprojectName: test-soa-project Y: : Y[INFO] ----------------------------------------------------------------------------[INFO] Using following parameters for creating project from Archetype: oracle-soa-application:12.1.3-0-0[INFO] ----------------------------------------------------------------------------[INFO] Parameter: groupId, Value: org.my.test[INFO] Parameter: artifactId, Value: test-soa-application[INFO] Parameter: version, Value: 1.0-SNAPSHOT[INFO] Parameter: package, Value: org.my.test[INFO] Parameter: packageInPathFormat, Value: org/my/test[INFO] Parameter: package, Value: org.my.test[INFO] Parameter: version, Value: 1.0-SNAPSHOT[INFO] Parameter: projectName, Value: test-soa-project[INFO] Parameter: groupId, Value: org.my.test[INFO] Parameter: adf, Value: .adf[INFO] Parameter: data, Value: .data[INFO] Parameter: artifactId, Value: test-soa-application[WARNING] Don't override file D:\tmp\test-soa-application\pom.xml[WARNING] Don't override file D:\tmp\test-soa-application\src\META-INF[WARNING] Don't override file D:\tmp\test-soa-application\src\META-INF\jps-config.xml[WARNING] Don't override file D:\tmp\test-soa-application\.adf\META-INF[WARNING] Don't override file D:\tmp\test-soa-application\.adf\META-INF\adf-config.xml[INFO] project created from Archetype in dir: D:\tmp\test-soa-application[INFO] ------------------------------------------------------------------------[INFO] BUILD SUCCESS[INFO] ------------------------------------------------------------------------[INFO] Total time: 24.866 s[INFO] Finished at: 2016-06-21T09:34:04-05:00[INFO] Final Memory: 15M/289M[INFO] ------------------------------------------------------------------------ D:\tmp>

Creating Standalone domain in Oracle SOA 12.1.3.0 using qs_config. Tried same in 12.2.1.0 version also but getting error just after UI gets launched

Creating Standalone domain in Oracle SOA 12.1.3.0 using qs_config. Tried same in 12.2.1.0 version also but gettingbelow  error just after UI gets launched com.oracle.cie.wizard.tasks.TaskExecutionException:CFGFWK-60930:Failed to select template SOA version: 12.1.3.0Platform: Windows 10 Error details:
RESOLVED Now>No need to set variable QS_TEMPLATES.It does not pick the variable from environment variables and hence path remain invalid . 1) Simply edit file qs_templates.cmd from location %Oracle_Home%\soa\common\bin Uncomment your choice in the file and save it, 2) simply run qs_config.cmd and create domain.   In my case content of file is as follows:#ECHO OFFset SOA_TMPL=%MW_HOME%/soa/common/templates/wls/oracle.soa_template_12.1.3.jarset BPM_TMPL=%MW_HOME%/soa/common/templates/wls/oracle.bpm_template_12.1.3.jarset AFP_TMPL=%MW_HOME%/soa/common/templates/wls/oracle.soa.fp_template_12.1.3.jarset OSB_TMPL=%MW_HOME%/osb/common/templates/wls/oracle.osb_template_12.1.3.jar#REM#REM Valid Choices. Uncomment as needed..#REM#REM set QS_TEMPLATES=%SOA_TMPL%#REM set QS_TEMPLATES=%BPM_TMPL%#REM set QS_TEMPLATES=%AFP_TMPL%set QS_TEMPLATES=%SOA_TMPL%,%OSB_TMPL%#REM set QS_TEMPLATES=%BPM_TMPL%,%OSB_TMPL%ECHO ************************************************ECHO ** Please ensure you set the environment variableECHO ** QS_TEMPLATES to a valid value to configureECHO ** your domain. For examples please reviewECHO ** MWHOME/soa/common/bin/qs_templates.cmdECHO ************************************************ECHO ** Current setting of QS_TEMPLATES is:ECHO **   [%QS_TEMPLATES%]ECHO ************************************************#ECHO OFFset SOA_TMPL=%MW_HOME%/soa/common/templates/wls/oracle.soa_template_12.1.3.jarset BPM_TMPL=%MW_HOME%/soa/common/templates/wls/oracle.bpm_template_12.1.3.jarset AFP_TMPL=%MW_HOME%/soa/common/templates/wls/oracle.soa.fp_template_12.1.3.jarset OSB_TMPL=%MW_HOME%/osb/common/templates/wls/oracle.osb_template_12.1.3.jar#REM#REM Valid Choices. Uncomment as needed..#REM#REM set QS_TEMPLATES=%SOA_TMPL%#REM set QS_TEMPLATES=%BPM_TMPL%#REM set QS_TEMPLATES=%AFP_TMPL%set QS_TEMPLATES=%SOA_TMPL%,%OSB_TMPL%#REM set QS_TEMPLATES=%BPM_TMPL%,%OSB_TMPL%ECHO ************************************************ECHO ** Please ensure you set the environment variableECHO ** QS_TEMPLATES to a valid value to configureECHO ** your domain. For examples please reviewECHO ** MWHOME/soa/common/bin/qs_templates.cmdECHO ************************************************ECHO ** Current setting of QS_TEMPLATES is:ECHO **   [%QS_TEMPLATES%]ECHO ************************************************

New naming context

  Please help :   How to create a new naming context in Oracle Unified directory for TNS Names alias ?I want to create a one naming context for Production d.b. , other - for test data bases . For example one for : dc=production,dc=corp,dc=com other : dc=test,dc=corp,dc=com Thank's
I have been added a new dc , with ldapmodify : dn: dc=production,dc=corp,dc=,dc=comchangetype: addobjectclass: topobjectclass: domainobjectclass: orclSubscriberdc: Production But how now to create a : OracleContext ?

EPM System Installer 11.1.2.3 Fails to Install Oracle DB Client 32 Bit and 64 Bit

Hi, We are trying to do a new installation of Oracle Hyperion EPM 11.1.2.3 on Windows 2008 Server R2. Its a standard deployment with one Foundation Server and One Essbase Server. When trying to install on Foundation Server, the EPM System Installer fails to install Oracle Database Clients. The First Question we have is, we are planning on using Microsoft SQL Server for the Shared Services Repository and so want to know if it is safe to ignore this error and move forward. The second question is , if we need the error to be resolved, we want to know why the system installer is failing. Looking at the log, ORACLE_HOME is set to something which is either invalid or is longer than 128 characters. The diagnostics show the below error message: INFO: Going to copy both pre copy and post copy files C:\Users\SA-ESS~1\AppData\Local\Temp\2\OraInstall2013-11-11_04-16-01PM/oracle.client_Administrator.propertiesINFO: install properties filename: C:\Users\SA-ESS~1\AppData\Local\Temp\2\OraInstall2013-11-11_04-16-01PM/oracle.client_Administrator.propertiesINFO: Set oracle.install.customdeinstallcommand to %ORACLE_HOME%/deinstall/deinstallINFO: Set oracle.install.customizedeinstall to trueINFO: Set oracle.installer.ORACLE_BASEvar to ORACLE_BASEINFO: Set oracle.installer.LibPerms to 0755 INFO: Set oracle.installer.summary_expand_nodes to NewLangs,Global,Space,LangsINFO: Set oracle.installer.LibExtns to .sl,.sl.11.1,.so,.so.11.1,.sl.1.0,.so.1.0INFO: Set oracle.installer.mandatorySetup to trueINFO: Set oracle.installer.useORACLE_BASE to trueINFO: Set oracle.installer.removeallfiles to trueINFO: Set oracle.installer.additionaltool_continue_onerror to trueINFO: *** Specify Home Details Page***INFO: Setting the 'OracleHome ( ORACLE_HOME )' property to 'D:\Oracle\Middleware\EPMSystem11R1\..\dbclient32'. Received the value from the command line.INFO: Setting the 'OracleHomeName ( ORACLE_HOME_NAME )' property to 'OraClient11g32_sa-essbaseapp'. Received the value from the command line.INFO: Setting the 'OracleBase ( ORACLE_BASE )' property to 'D:\Oracle\Middleware\EPMSystem11R1\..\'. Received the value from the command line.SEVERE: The Oracle Home name is not valid. Oracle Home names must be 128 characters or less and contain only alphanumeric characters and underscores.INFO: Alert Handler not registered, using Super class functionalityINFO: Alert Handler not registered, using Super class functionalityINFO: User Selected: Yes/OK INFO: Shutting down OUISetupDriver.JobExecutorThreadSEVERE: [FATAL] [INS-10008] Session initialization failed   CAUSE: An unexpected error occured while initializing the session.   ACTION: Contact Oracle Support Services or refer logs   SUMMARY:       - .Refer associated stacktrace #oracle.install.commons.util.exception.DefaultErrorAdvisor:1096INFO: Advice is ABORTSEVERE: Unconditional ExitINFO: Adding ExitStatus FAILURE to the exit status setINFO: Finding the most appropriate exit status for the current applicationINFO: Exit Status is -1INFO: Shutdown Oracle Client Installer
I got my answer from the log. The ORACLE_HOME_NAME is the issue. Our Deployment account has a hyphen - in it and so the oui is failing to initialize.
Hi, I am facing the very same issue ; that the ORACLE_HOME _NAME is exceeding 128 characters and hence fails. Pls ellaborate on what the deployment account is causing this as you ahve suggested above in the thread. Thanks and RegardsDilip

glassfish:run - Context initialization failed - class path resource

i got glassfish:run to work great on a simple project, but i have problem loading classpath resources with my maven2 spring/jpa project
my question is regarding where glassfish embedded server picks up configuration files. i use maven filters to enable different build environments for our application and use f.eks mvn glassfish:run -Denv=development and then apply filters in pom.xml like so:
in my src/main/filters/environment/development.properties i define variables like f.ex:
db.initialSize=2
in my pom.xml i use this to filter the resources in src/main/resources
src/main/filters/environment/${environment}.properties
src/main/resources
true
and my properties in f.ex src/main/resources/myapp-dao-beans.xml are defined like this:
          
This works great with jetty:run and tomcat:run, but with glassfish:run i get
org.springframework.web.context.ContextLoader initWebApplicationContext
SEVERE: Context initialization failed
exception is org.springframework.beans.factory.BeanCreationException: Error creating bean with name 'entityManagerFactory' defined in class path resource [myapp-dao-beans.xml]: [java.lang.String] to required type [int] for property 'initialSize'; nested exception is java.lang.NumberFormatException: For input string: "${db.initialSize}"
So it seems like glassfish:run tries to load my properties from src/main/resources directly instead of loading the filtered resources from target/classes. Does anyone know how to configure glassfish embeddable to load the correct class path resources when initializing the webapplication context?
In my web.xml i use a org.springframework.web.context.ContextLoaderListener and the contextConfigLocation uses classpath:psk-dao-beans.xml
Any feedback is appreciated.
-+petrusnilsen+-

Categories

Resources